{"text_format":"1","workbook":"xlsx","n_sheets":12,"sheets":["Projekt węzła","Dane wejściowe","Wymienniki CWU","Arkusz3","PN-C.O.","PN-NWP","PN-C.W.U.","Wymienniki CO","HEX","ZB","NWP","gestosc wody"],"not_rendered":{"charts":0,"images":8,"macros":1,"external_links":1,"defined_names":0,"comments":3,"pivot_tables":0},"unopened":[],"bounds":{"document_bytes":16777216,"sheet_cells":100000,"rows_first":2000,"rows_last":500,"rows_between":2000,"halvings":0,"cell_chars":16384,"cell_head_chars":4096},"cells_cut":0,"cells_raw":0,"read":"whole","date_system":"1900"}

{"sheet":"Projekt węzła","index":0,"n_rows":742,"n_cols":10,"rows_kept":742,"cut":false,"hidden":false,"merged":[[267,0,267,9],[310,0,310,9],[354,0,354,9],[398,0,398,9],[371,0,371,3],[709,5,709,6],[415,0,415,5],[416,0,416,5],[707,5,707,6],[707,7,707,8],[708,5,708,6],[708,7,708,8],[707,0,707,3],[319,7,319,8],[334,7,334,8],[708,0,708,3],[412,0,412,8],[320,7,320,9],[325,0,325,9],[336,0,336,3],[335,7,335,9],[400,0,400,8],[402,0,402,3],[403,0,403,5],[321,0,321,3],[414,0,414,3],[369,0,369,4],[740,0,740,3],[741,0,741,3],[713,0,713,8],[734,0,734,3],[735,0,735,3],[736,0,736,3],[738,2,738,3],[739,2,739,3],[737,5,737,6],[737,7,737,8],[716,0,716,3],[717,0,717,3],[718,0,718,3],[729,0,729,3],[732,0,732,3],[733,0,733,3],[736,5,736,6],[736,7,736,8],[729,5,729,6],[726,7,726,8],[706,0,706,9],[729,7,729,8],[732,5,732,6],[732,7,732,8],[740,5,740,8],[741,5,741,8],[733,5,733,6],[733,7,733,8],[734,5,734,6],[734,7,734,8],[735,5,735,6],[735,7,735,8],[728,0,728,3],[709,0,709,3],[710,0,710,3],[711,0,711,3],[712,0,712,3],[714,0,714,4],[726,0,726,3],[727,0,727,3],[709,7,709,8],[719,0,719,3],[720,0,720,3],[710,5,710,6],[727,5,727,6],[727,7,727,8],[728,5,728,6],[728,7,728,8],[726,5,726,6],[723,0,723,3],[725,0,725,3],[715,0,715,3],[725,5,725,6],[725,7,725,8],[710,7,710,8],[711,5,711,6],[711,7,711,8],[719,5,719,6],[719,7,719,8],[0,0,0,9],[54,0,56,9],[75,0,76,9],[77,0,77,9],[78,0,79,9],[90,0,92,9],[59,0,60,9],[61,0,74,9],[41,0,42,9],[5,0,6,9],[105,0,115,9],[222,0,223,9],[235,0,236,9],[238,0,239,9],[2,0,3,9],[162,0,166,9],[181,0,185,9],[195,0,196,9],[198,0,199,9],[201,0,202,9],[204,0,206,9],[123,0,124,9],[148,0,149,9],[152,0,153,9],[190,0,192,9],[159,0,161,9],[116,0,120,9],[127,0,128,9],[186,0,187,9],[208,0,212,9],[134,0,139,9],[225,0,226,9],[229,0,231,9],[227,0,228,9],[692,4,692,6],[692,7,692,8],[703,1,703,8],[615,1,615,8],[662,1,662,8],[418,0,418,8],[420,0,420,3],[421,0,421,5],[422,0,422,5],[424,0,424,3],[426,0,426,5],[425,0,425,5],[530,0,530,9],[531,0,531,9],[574,0,574,9],[575,0,575,9],[499,0,499,9],[442,0,442,9],[490,0,490,4],[491,0,491,4],[493,0,493,4],[593,1,593,5],[603,4,603,6],[603,7,603,8],[486,0,486,9],[488,0,488,9],[454,0,454,9],[404,0,404,5],[406,0,406,8],[408,0,408,3],[409,0,409,5],[410,0,410,5],[685,1,685,5],[618,0,618,9],[620,0,620,9],[622,0,622,4],[623,0,623,4],[625,0,625,4],[624,8,624,9],[631,0,631,9],[663,1,663,8]]}
["OPIS TECHNICZNY"]
[]
["Węzeł cieplny dwufunkycjny centralnego ogrzewania oraz ciepłej wody użytkowej DSA WALL 2F-3 o kodzie 146B8774"]
[]
[]
["*Moduł przyłączeniowy nie jest ujęty w projekcie i obliczeniach węzła. Należy go wykonać zgodnie z wymaganiami lokalnego przedsiębiorstwa energetyki cieplnej"]
[]
[]
["Spis treści:"]
[{"$f":"A46","v":"1. Opis techniczny"}]
[{"$f":"A47","v":"1.1. Podstawa opracowania"}]
[{"$f":"A54","v":"1.2. Zakres opracowania"}]
[{"$f":"A59","v":"1.3. Opis ogólny węzła"}]
[{"$f":"A90","v":"2. Wyposażenie węzła cieplnego"}]
[{"$f":"A105","v":"2.1.1. Wymienniki ciepła"}]
{"$rows_left_out":728}
{"sheet":"Dane wejściowe","index":1,"n_rows":35,"n_cols":4,"rows_kept":35,"cut":false,"hidden":false,"merged":[[34,0,35,5]]}
[]
[null,"Dane do obliczeń (należy wypełnić białe pola)"]
[]
[null,"Wybierz program temperatur C.O."]
[null,"Temperatura zasilania wody sieciowej (z warunków uzyskanych od dostawcy ciepła systemowego)",null,"°C"]
[null,"Temperatura powrotu wody sieciowej",{"$f":"IF(C7>=70,C8+5,\"\")","v":""},"°C"]
[null,"Temperatura zasilania instalacji c.o.",null,"°C"]
[null,"Temperatura powrotu instalacji c.o.",{"$f":"IF(C7<50,\"\",C7-20)","v":""},"°C"]
[]
[null,"Wysokość budynku",null,"m"]
[]
[null,"Wybierz program temperatur C.W.U."]
[null,"Temperatura zasilania wody sieciowej (z warunków uzyskanych od dostawcy ciepła systemowego)",null,"°C"]
[null,"Temperatura powrotu wody sieciowej (z warunków uzyskanych od dostawcy ciepła systemowego)",null,"°C"]
[null,"Temperatura zasilania c.w.u.",60,"°C"]
{"$rows_left_out":21}
{"sheet":"Wymienniki CWU","index":2,"n_rows":484,"n_cols":58,"rows_kept":484,"cut":false,"hidden":true,"merged":[]}
["Data","2017-09-09T11:22:52"]
["aplikacja","X Danfoss-XB",null,null,null,null,null,null,null,null,null,null,null,null,null,null,null,null,null,null,null,null,null,null,null,null,null,null,null,null,null,null,null,null,null,null,null,null,null,null,null,null,null,null,null,null,null,null,null,null,"spadek po str siec","spadek po str inst"]
["Tryb","Sprawdzenie",null,null,null,null,null,null,null,null,null,null,null,null,null,null,null,null,null,null,null,null,null,null,null,null,null,null,null,null,null,null,null,null,null,null,null,null,null,null,null,null,null,null,null,null,null,null,null,null,{"$f":"SUM(AY5:AY484)","v":0},0]
["isROT","Standardowy","Dozw. komb. płyt M Mieszanie płyt","Współprądowy","Równoległy","J.m.","Ilość stopni","Wymiennik ciepła","Typ płyty","Ilość kanałów kanału nr 1 Strona1","Ilość kanałów kanału nr 1 Strona2","Ilość kanałów kanału nr 2 Strona1","Ilość kanałów kanału nr 2 Strona2","Moc\n[kW]","Zapas powierzchni\n[%]","Czynnik Strona 1","Gaz1","Stężenie1\n[%]","Abs. Pressure1\n[bar]","Czynnik Strona 2","Gaz2","Stężenie2\n[%]","Abs. Pressure2\n[bar]","Temperatura na wlocie1\n[°C]","Temperatura na wylocie1\n[°C]","Masowe Natężenie przepływu1\n[kg/h]","Objętościowe Natężenie przepływu1\n[L/min]","Maks. spadek ciśnienia1\n[kPa]","Temperatura na wlocie2\n[°C]","Temperatura na wylocie2\n[°C]","Masowe Natężenie przepływu2\n[kg/h]","Objętościowe Natężenie przepływu2\n[L/min]","Maks. spadek ciśnienia2\n[kPa]","Masowe Natężenie przepływu Szer.-Równ.\n[kg/h]","Objętościowe Natężenie przepływu Szer.-Równ.\n[L/min]","Maks. spadek ciśnienia Szer.-Równ.\n[kPa]","FrameExtension(%)","Wymiennik ciepła","Grupowanie","Termin dostawy","PED","Zapas powierzchni\n[%]","Całkowita pow.\n[m^2]","HTC(Dostępny / Wymagany)\n[W/m^2-K]","LMTD\n[K]","NTU-1","NTU-2","Całkowity spadek ciśnienia-1\n[kPa]","Całkowity spadek ciśnienia-2\n[kPa]",null,{"$f":"ROUNDUP(Arkusz3!G16,0)","v":0},{"$f":"'Dane wejściowe'!C13","v":0},{"$f":"'Dane wejściowe'!C14","v":0}]
[0,0,0,0,1,1,1,"XB37","M",7,8,null,null,1,null,"Woda",null,null,null,"Woda",null,null,null,70,35,null,null,null,5,60,null,null,null,null,null,null,0,"XB37M-1-16 G 1 (20mm)","1*7M/1*8M","A","PED Art 4.3","373,4","0,78","331,7/70,1","18,20","1,92","3,03","0,02","0,01",{"$f":"AND(N5=$AY$4,X5=$AZ$4,Y5=$BA$4)","v":false},{"$f":"AX5*AV5","v":0},{"$f":"AX5*AW5","v":0}]
[0,1,0,0,1,1,1,"XB37","M",7,null,null,null,2,null,"Woda",null,null,null,"Woda",null,null,null,70,35,null,null,null,5,60,null,null,null,null,null,null,0,"XB37M-1-16 G 1 (20mm)","1*7M/1*8M","A","PED Art 4.3","287,4","0,78","542,9/140,1","18,20","1,92","3,03","0,06","0,03",{"$f":"AND(N6=$AY$4,X6=$AZ$4,Y6=$BA$4)","v":false},{"$f":"AX6*AV6","v":0},{"$f":"AX6*AW6","v":0},null,null,1,3,{"$f":"AND('Dane wejściowe'!$C$28>=BC6,'Dane wejściowe'!$C$28<BC7)","v":false},{"$f":"BD6*BE6","v":0}]
[0,1,0,0,1,1,1,"XB37","M",7,null,null,null,3,null,"Woda",null,null,null,"Woda",null,null,null,70,35,null,null,null,5,60,null,null,null,null,null,null,0,"XB37M-1-16 G 1 (20mm)","1*7M/1*8M","A","PED Art 4.3","244,6","0,78","724,4/210,2","18,20","1,92","3,03","0,11","0,05",false,0,0,null,null,2,3.5,{"$f":"AND('Dane wejściowe'!$C$28>=BC7,'Dane wejściowe'!$C$28<BC8)","v":false},{"$f":"BD7*BE7","v":0}]
[0,1,0,0,1,1,1,"XB37","M",7,null,null,null,4,null,"Woda",null,null,null,"Woda",null,null,null,70,35,null,null,null,5,60,null,null,null,null,null,null,0,"XB37M-1-16 G 1 (20mm)","1*7M/1*8M","A","PED Art 4.3","217,2","0,78","888,8/280,3","18,20","1,92","3,03","0,18","0,08",false,0,0,null,null,3,4,{"$f":"AND('Dane wejściowe'!$C$28>=BC8,'Dane wejściowe'!$C$28<BC9)","v":false},0]
[0,1,0,0,1,1,1,"XB37","M",7,null,null,null,5,null,"Woda",null,null,null,"Woda",null,null,null,70,35,null,null,null,5,60,null,null,null,null,null,null,0,"XB37M-1-16 G 1 (20mm)","1*7M/1*8M","A","PED Art 4.3","197,3","0,78","1041,7/350,3","18,20","1,92","3,03","0,26","0,11",false,0,0,null,null,4,4.5,{"$f":"AND('Dane wejściowe'!$C$28>=BC9,'Dane wejściowe'!$C$28<BC10)","v":false},0]
[0,1,0,0,1,1,1,"XB37","M",7,null,null,null,6,null,"Woda",null,null,null,"Woda",null,null,null,70,35,null,null,null,5,60,null,null,null,null,null,null,0,"XB37M-1-16 G 1 (20mm)","1*7M/1*8M","A","PED Art 4.3","182,1","0,78","1185,8/420,4","18,20","1,92","3,03","0,36","0,15",false,0,0,null,null,5,5,{"$f":"AND('Dane wejściowe'!$C$28>=BC10,'Dane wejściowe'!$C$28<BC11)","v":false},0]
[0,1,0,0,1,1,1,"XB37","M",7,null,null,null,7,null,"Woda",null,null,null,"Woda",null,null,null,70,35,null,null,null,5,60,null,null,null,null,null,null,0,"XB37M-1-16 G 1 (20mm)","1*7M/1*8M","A","PED Art 4.3","169,8","0,78","1323,0/490,5","18,20","1,92","3,03","0,46","0,20",false,0,0,null,null,6,5.5,{"$f":"AND('Dane wejściowe'!$C$28>=BC11,'Dane wejściowe'!$C$28<BC12)","v":false},0]
[0,1,0,0,1,1,1,"XB37","M",7,null,null,null,8,null,"Woda",null,null,null,"Woda",null,null,null,70,35,null,null,null,5,60,null,null,null,null,null,null,0,"XB37M-1-16 G 1 (20mm)","1*7M/1*8M","A","PED Art 4.3","159,5","0,78","1454,6/560,5","18,20","1,92","3,03","0,57","0,25",false,0,0,null,null,7,6,{"$f":"AND('Dane wejściowe'!$C$28>=BC12,'Dane wejściowe'!$C$28<BC13)","v":false},0]
[0,1,0,0,1,1,1,"XB37","M",7,null,null,null,9,null,"Woda",null,null,null,"Woda",null,null,null,70,35,null,null,null,5,60,null,null,null,null,null,null,0,"XB37M-1-16 G 1 (20mm)","1*7M/1*8M","A","PED Art 4.3","150,8","0,78","1581,4/630,6","18,20","1,92","3,03","0,70","0,30",false,0,0,null,null,8,6.5,{"$f":"AND('Dane wejściowe'!$C$28>=BC13,'Dane wejściowe'!$C$28<BC14)","v":false},0]
[0,1,0,0,1,1,1,"XB37","M",7,null,null,null,10,null,"Woda",null,null,null,"Woda",null,null,null,70,35,null,null,null,5,60,null,null,null,null,null,null,0,"XB37M-1-16 G 1 (20mm)","1*7M/1*8M","A","PED Art 4.3","143,2","0,78","1704,1/700,6","18,20","1,92","3,03","0,83","0,36",false,0,0,null,null,9,7,{"$f":"AND('Dane wejściowe'!$C$28>=BC14,'Dane wejściowe'!$C$28<BC15)","v":false},0]
[0,1,0,0,1,1,1,"XB37","M",7,null,null,null,11,null,"Woda",null,null,null,"Woda",null,null,null,70,35,null,null,null,5,60,null,null,null,null,null,null,0,"XB37M-1-16 G 1 (20mm)","1*7M/1*8M","A","PED Art 4.3","136,6","0,78","1823,3/770,7","18,20","1,92","3,03","0,97","0,42",false,0,0,null,null,10,7.5,{"$f":"AND('Dane wejściowe'!$C$28>=BC15,'Dane wejściowe'!$C$28<BC16)","v":false},0]
{"$rows_left_out":470}
{"sheet":"Arkusz3","index":3,"n_rows":26,"n_cols":10,"rows_kept":26,"cut":false,"hidden":true,"merged":[]}
[]
[null,"izolacja budynku",null,"temp siec zima",null,"temp instal",null,"temp siec lato",null,"temp siec lato powrot"]
[null,"TAK",null,130,null,90,null,70,null,35]
[null,"NIE",null,125,null,85,null,65,null,30]
[null,null,null,120,null,80,null,null,null,25]
[null,null,null,115,null,75,null,null,null,20]
[null,null,null,110,null,70]
[null,null,null,105]
[null,null,null,100]
[]
[]
[]
[]
[]
[null,null,"co",{"$f":"'Dane wejściowe'!C18","v":0},{"$f":"'Dane wejściowe'!C26","v":0},null,{"$f":"ROUND(MAX(D15,E15),2)","v":0}]
{"$rows_left_out":12}
{"sheet":"PN-C.O.","index":4,"n_rows":46,"n_cols":14,"rows_kept":46,"cut":false,"hidden":true,"merged":[[42,1,42,8],[45,0,45,8],[1,1,1,8],[3,1,3,8],[14,1,14,2],[21,1,21,5],[32,4,32,6],[32,7,32,8]]}
[]
[null,"Dobór zaworu bezpieczeństwa dla obiegu c.o."]
[]
[null,"Obliczenia przeprowadzono zgodnie z p. 2.2.2. normy PN-B-02414:1999"]
[null,null,null,null," "]
[null,"Dobrano zawór bezpieczeństwa:"]
[null,"Typ",null,null,null,null,null,{"$f":"VLOOKUP(L17,ZB!A19:C122,3,FALSE)","v":1915},null,1,null,null,{"$f":"IF(H7=\"niestandardowe p1\",\"dla zaworów Flamco dostępne tylko ciśnienia nastawy zaworu 2,5 i 3 bar\",\" \")","v":" "}]
[null,"Średnica nominalna                                                                       ",null,null,null,null,null,{"$f":"CONCATENATE(\"DN \",H17)","v":"DN 25"},"mm",null,null,null,{"$f":"IF(H7=\"niestandardowe p1\",\"dla zaworów ARMAK dostępne tylko ciśnienia nastawy zaworu 2,5-5 bar\",\" \")","v":" "}]
[null,"Ilość zaworów",null,null,null,null,null,{"$f":"IF(54*SQRT((D34/(H22*SQRT(H18*H21))))/H10<=1,1,(IF(54*SQRT((D34/2/(H22*SQRT(H18*H21))))/H10<=1,2,(IF(54*SQRT((D34/3/(H22*SQRT(H18*H21))))/H10<=1,3,\"n > 3\")))))","v":{"$error":"#N/A"}},"szt.",null,null,null,{"$f":"IF(H9=\"n > 3\",\"liczba zaworów wieksza niż 3, zwiększ średnicę zaworu\",\" \")","v":{"$error":"#N/A"}}]
[null,"Min. średnica wewnętrzna",null,null,null,null,"d0",{"$f":"VLOOKUP(L17,ZB!A19:E122,5,FALSE)","v":20},"mm"]
[null,"Ciśnienie początku otwarcia",null,null,null,null,"p0",{"$f":"H18","v":2.5},"bar"]
[null,"Wsp. wypływu dla cieczy",null,null,null,null,"acrz",{"$f":"VLOOKUP(L17,ZB!A19:G122,7,FALSE)","v":0.41}]
[null,"Producent",null,null,null,null,null,{"$f":"H16","v":"HUSTY SYR"}]
[]
[null,"Założenia:",null,null,null,null,null,null,null,null,null,null,null,"UWAGA !"]
{"$rows_left_out":32}
{"sheet":"PN-NWP","index":5,"n_rows":55,"n_cols":14,"rows_kept":55,"cut":false,"hidden":true,"merged":[[1,0,1,8],[3,0,3,8],[54,0,54,8]]}
[]
["Dobór przeponowego naczynia wzbiorczego"]
[]
["Obliczenia przeprowadzono zgodnie z normą PN-B-02414:1999"]
[]
[null,"Dobrano naczynie wzbiorcze:"]
[null,"Typ",null,null,null,null,null,{"$f":"VLOOKUP(K7,NWP!A27:D110,3,FALSE)","v":{"$error":"#N/A"}},null,1,{"$f":"CONCATENATE(H18,H9)","v":{"$error":"#N/A"}}]
[null,"Ilość naczyń",null,null,null,null,null,{"$f":"N8","v":1},"szt.",null,null,null,null,1]
[null,"Pojemność naczynia                                     ",null,null,null,null,null,{"$f":"IF(H18=\"REFLEX\",NWP!O28,IF(H18=\"FLAMCO typ C\",NWP!O44,IF(H18=\"FLAMCO typ K\",NWP!O58,IF(H18=\"CIMM\",NWP!O66,IF(H18=\"VAREM\",NWP!O87,NWP!O95)))))","v":{"$error":"#N/A"}},"l"]
[null,"Wysokość",null,null,null,null,null,{"$f":"VLOOKUP(K7,NWP!A28:E110,5,FALSE)","v":{"$error":"#N/A"}},"mm"]
[null,"Średnica",null,null,null,null,null,{"$f":"VLOOKUP(K7,NWP!A28:F110,6,FALSE)","v":{"$error":"#N/A"}},"mm"]
[null,"Średnica przyłącza",null,null,null,null,null,{"$f":"VLOOKUP(K7,NWP!A28:H110,8,FALSE)","v":{"$error":"#N/A"}},"mm"]
[null,"Ciśnienie wstepne",null,null,null,null,null,{"$f":"E35","v":0.2},"bar"]
[null,"Producent",null,null,null,null,null,{"$f":"VLOOKUP(K7,NWP!A28:B110,2,FALSE)","v":{"$error":"#N/A"}}]
[]
{"$rows_left_out":41}
{"sheet":"PN-C.W.U.","index":6,"n_rows":46,"n_cols":15,"rows_kept":46,"cut":false,"hidden":true,"merged":[[44,1,44,8],[45,0,45,8],[46,0,46,8],[1,1,1,8],[3,1,3,8],[16,1,16,2],[25,1,25,5],[33,4,33,6],[33,7,33,8]]}
[]
[null,"Dobór zaworu bezpieczeństwa dla obiegu c.w.u"]
[]
[null,"Obliczenia przeprowadzono zgodnie z p.. 3.2.5.2. normy PN-76/B-02440"]
[]
[null,"Dobrano zawór bezpieczeństwa:"]
[null,"Typ",null,null,null,null,null,{"$f":"VLOOKUP(M18,ZB!A135:C190,3,FALSE)","v":2115},null,1]
[null,"Średnica nominalna                                                                      ",null,null,null,null,null,{"$f":"CONCATENATE(\"DN \",H19)","v":"DN 20"},"mm"]
[null,"Ilość zaworów",null,null,null,null,null,{"$f":"IF(SQRT(((4*D36)/(3.14*1.59*H13*SQRT((1.1*H20-H21)/0.98*H24))))/H10<=1,1,(IF(SQRT(((4*D36/2)/(3.14*1.59*H13*SQRT((1.1*H20-H21)/0.98*H24))))/H10<=1,2,(IF(SQRT(((4*D36/3)/(3.14*1.59*H13*SQRT((1.1*H20-H21)/0.98*H24))))/H10<=1,3,\"n > 3\")))))","v":1},"szt.",null,null,null,null,{"$f":"IF(H9=\"n > 3\",\"liczba zaworów wieksza niż 3, zwiększ średnicę zaworu\",\" \")","v":" "}]
[null,"Min. średnica wewnętrzna",null,null,null,null,"d0",{"$f":"VLOOKUP(M18,ZB!A135:E190,5,FALSE)","v":14},"mm"]
[null,"Ciśnienie początku otwarcia",null,null,null,null,"p0",{"$f":"H20","v":6},"bar"]
[null,"Wsp. wypływu dla gazu dla dobranych zaworów",null,null,null,null,"a",{"$f":"VLOOKUP(M18,ZB!A135:G190,7,FALSE)","v":0.55000000000000004}]
[null,"ac dla dobranego zaworu",null,null,null,null,"ac=0,35*a",{"$f":"0.35*H12","v":0.1925}]
[null,"Wsp. wypływu wody grzejnej ",null,null,null,null,"ac1",1]
[null,"Producent",null,null,null,null,null,{"$f":"H18","v":"HUSTY SYR"}]
{"$rows_left_out":32}
{"sheet":"Wymienniki CO","index":7,"n_rows":1054,"n_cols":54,"rows_kept":1054,"cut":false,"hidden":true,"merged":[]}
["Data","2017-09-09T10:13:13"]
["aplikacja","X Danfoss-XB",null,null,null,null,null,null,null,null,null,null,null,null,null,null,null,null,null,null,null,null,null,null,null,null,null,null,null,null,null,null,null,null,null,null,null,null,null,null,null,null,null,null,null,null,null,null,null,null,"spadek po wys","spadek po nis"]
["Tryb","Sprawdzenie",null,null,null,null,null,null,null,null,null,null,null,null,null,null,null,null,null,null,null,null,null,null,null,null,null,null,null,null,null,null,null,null,null,null,null,null,null,null,null,null,null,null,null,null,null,null,null,null,{"$f":"SUM(AY5:AY1054)","v":0},{"$f":"SUM(AZ5:AZ1054)","v":0},"temp zas siec","temp zas co"]
["isROT","Standardowy","Dozw. komb. płyt M Mieszanie płyt","Współprądowy","Równoległy","J.m.","Ilość stopni","Wymiennik ciepła","Typ płyty","Ilość kanałów kanału nr 1 Strona1","Ilość kanałów kanału nr 1 Strona2","Ilość kanałów kanału nr 2 Strona1","Ilość kanałów kanału nr 2 Strona2","Moc\n[kW]","Zapas powierzchni\n[%]","Czynnik Strona 1","Gaz1","Stężenie1\n[%]","Abs. Pressure1\n[bar]","Czynnik Strona 2","Gaz2","Stężenie2\n[%]","Abs. Pressure2\n[bar]","Temperatura na wlocie1\n[°C]","Temperatura na wylocie1\n[°C]","Masowe Natężenie przepływu1\n[kg/h]","Objętościowe Natężenie przepływu1\n[L/min]","Maks. spadek ciśnienia1\n[kPa]","Temperatura na wlocie2\n[°C]","Temperatura na wylocie2\n[°C]","Masowe Natężenie przepływu2\n[kg/h]","Objętościowe Natężenie przepływu2\n[L/min]","Maks. spadek ciśnienia2\n[kPa]","Masowe Natężenie przepływu Szer.-Równ.\n[kg/h]","Objętościowe Natężenie przepływu Szer.-Równ.\n[L/min]","Maks. spadek ciśnienia Szer.-Równ.\n[kPa]","FrameExtension(%)","Wymiennik ciepła","Grupowanie","Termin dostawy","PED","Zapas powierzchni\n[%]","Całkowita pow.\n[m^2]","HTC(Dostępny / Wymagany)\n[W/m^2-K]","LMTD\n[K]","NTU-1","NTU-2","Całkowity spadek ciśnienia-1\n[kPa]","Całkowity spadek ciśnienia-2\n[kPa]",null,null,{"$f":"ROUNDUP(Arkusz3!G15,0)","v":0},{"$f":"'Dane wejściowe'!C5","v":0},{"$f":"'Dane wejściowe'!C7","v":0}]
[0,0,0,0,1,1,1,"XB37","L",4,5,null,null,1,null,"Woda",null,null,null,"Woda",null,null,null,130,75,null,null,null,70,90,null,null,null,null,null,null,0,"XB37L-1-10 G 1 (20mm)","1*4L/1*5L","B","PED Art 4.3","356,5","0,45","605,3/132,6","16,83","3,28","1,19","0,00","0,02",{"$f":"AND(N5=$AZ$4,X5=$BA$4,AD5=$BB$4)","v":false},{"$f":"AX5*AV5","v":0},{"$f":"AX5*AW5","v":0}]
[0,1,0,0,1,1,1,"XB37","L",4,null,null,null,2,null,"Woda",null,null,null,"Woda",null,null,null,130,75,null,null,null,70,90,null,null,null,null,null,null,0,"XB37L-1-10 G 1 (20mm)","1*4L/1*5L","B","PED Art 4.3","271,0","0,45","983,9/265,2","16,83","3,28","1,19","0,02","0,07",{"$f":"AND(N6=$AZ$4,X6=$BA$4,AD6=$BB$4)","v":false},{"$f":"AX6*AV6","v":0},{"$f":"AX6*AW6","v":0}]
[0,1,0,0,1,1,1,"XB37","L",4,null,null,null,3,null,"Woda",null,null,null,"Woda",null,null,null,130,75,null,null,null,70,90,null,null,null,null,null,null,0,"XB37L-1-10 G 1 (20mm)","1*4L/1*5L","B","PED Art 4.3","228,5","0,45","1306,9/397,9","16,83","3,28","1,19","0,04","0,16",false,0,0]
[0,1,0,0,1,1,1,"XB37","L",4,null,null,null,4,null,"Woda",null,null,null,"Woda",null,null,null,130,75,null,null,null,70,90,null,null,null,null,null,null,0,"XB37L-1-10 G 1 (20mm)","1*4L/1*5L","B","PED Art 4.3","201,2","0,45","1598,0/530,5","16,83","3,28","1,19","0,06","0,27",false,0,0]
[0,1,0,0,1,1,1,"XB37","L",4,null,null,null,5,null,"Woda",null,null,null,"Woda",null,null,null,130,75,null,null,null,70,90,null,null,null,null,null,null,0,"XB37L-1-10 G 1 (20mm)","1*4L/1*5L","B","PED Art 4.3","181,6","0,45","1867,3/663,1","16,83","3,28","1,19","0,09","0,40",false,0,0]
[0,1,0,0,1,1,1,"XB37","L",4,null,null,null,6,null,"Woda",null,null,null,"Woda",null,null,null,130,75,null,null,null,70,90,null,null,null,null,null,null,0,"XB37L-1-10 G 1 (20mm)","1*4L/1*5L","B","PED Art 4.3","166,5","0,45","2120,3/795,7","16,83","3,28","1,19","0,13","0,56",false,0,0]
[0,1,0,0,1,1,1,"XB37","L",4,null,null,null,7,null,"Woda",null,null,null,"Woda",null,null,null,130,75,null,null,null,70,90,null,null,null,null,null,null,0,"XB37L-1-10 G 1 (20mm)","1*4L/1*5L","B","PED Art 4.3","154,3","0,45","2360,4/928,3","16,83","3,28","1,19","0,17","0,74",false,0,0]
[0,1,0,0,1,1,1,"XB37","L",4,null,null,null,8,null,"Woda",null,null,null,"Woda",null,null,null,130,75,null,null,null,70,90,null,null,null,null,null,null,0,"XB37L-1-10 G 1 (20mm)","1*4L/1*5L","B","PED Art 4.3","144,1","0,45","2589,9/1060,9","16,83","3,28","1,19","0,21","0,94",false,0,0]
[0,1,0,0,1,1,1,"XB37","L",4,null,null,null,9,null,"Woda",null,null,null,"Woda",null,null,null,130,75,null,null,null,70,90,null,null,null,null,null,null,0,"XB37L-1-10 G 1 (20mm)","1*4L/1*5L","B","PED Art 4.3","135,5","0,45","2810,5/1193,6","16,83","3,28","1,19","0,26","1,17",false,0,0]
[0,1,0,0,1,1,1,"XB37","L",4,null,null,null,10,null,"Woda",null,null,null,"Woda",null,null,null,130,75,null,null,null,70,90,null,null,null,null,null,null,0,"XB37L-1-10 G 1 (20mm)","1*4L/1*5L","B","PED Art 4.3","128,0","0,45","3023,3/1326,2","16,83","3,28","1,19","0,32","1,42",false,0,0]
[0,1,0,0,1,1,1,"XB37","L",4,null,null,null,11,null,"Woda",null,null,null,"Woda",null,null,null,130,75,null,null,null,70,90,null,null,null,null,null,null,0,"XB37L-1-10 G 1 (20mm)","1*4L/1*5L","B","PED Art 4.3","121,4","0,45","3229,4/1458,8","16,83","3,28","1,19","0,38","1,69",false,0,0]
{"$rows_left_out":1040}
{"sheet":"HEX","index":8,"n_rows":450,"n_cols":5,"rows_kept":450,"cut":false,"hidden":true,"merged":[]}
[null,"A",null,"???"]
["Typ wymiennika","Pole max. przekroju pojedyńczego\nkanału przepływowego - mm2","Pole max. przekroju pojedyńczego\nkanału przepływowego - m2","pojemność wodna na płytę","max liczba płyt"]
["XB04",34,{"$f":"B3*0.000001","v":3.4E-5},0.06,70]
["XB05M",6,6.0000000000000002E-6,0.06,70]
["XB06H+",3,3.0000000000000001E-6,1.7000000000000001E-2,70]
["XB06H",5,4.9999999999999996E-6,1.7000000000000001E-2,70]
["XB06L",9,9.0000000000000002E-6,2.5000000000000001E-2,70]
["XB10",41,4.1E-5,0.05,70]
["XB12H",4,3.9999999999999998E-6,0.05,70]
["XB12M",6,6.0000000000000002E-6,0.05,70]
["XB12L",9,9.0000000000000002E-6,0.05,70]
["XB20",41,4.1E-5,0.06,70]
["XB24",35,{"$f":"B13*0.000001","v":3.4999999999999997E-5},0.1,70]
["XB30",41,4.1E-5,7.4999999999999997E-2,100]
["XB37L",16,1.5999999999999999E-5,0.10199999999999999,120]
{"$rows_left_out":436}
{"sheet":"ZB","index":9,"n_rows":304,"n_cols":9,"rows_kept":304,"cut":false,"hidden":true,"merged":[[2,8,2,20],[12,3,12,5]]}
[]
[null,null,null,"zawory bezpieczeństwa","HUSTY SYR","HUSTY SYR","cisnienia c.o.","cisnienia c.w.u."]
[null,null,null,null,"FLAMCO","ARMAK",2.5,4]
[null,null,null,null,"ARMAK",null,3,4.5]
[null,null,null,null,null,null,3.5,5]
[null,null,null,null,null,null,4,6]
[null,null,null,null,null,null,4.5,7]
[null,null,null,null,null,null,5,8]
[null,null,null,null,null,null,5.5,10]
[null,null,null,null,null,null,6]
[]
[]
[]
[]
["zawory na c.o."]
{"$rows_left_out":290}
{"sheet":"NWP","index":10,"n_rows":110,"n_cols":19,"rows_kept":110,"cut":false,"hidden":true,"merged":[]}
[]
[]
[]
[null,"Producenci",null,"REFLEX",null,null,"Tz ","gęstość wody","tz-t1","dV"]
[null,null,null,"FLAMCO typ C",null,null,"C","kg/m3","K","dm3/kg"]
[null,null,null,"FLAMCO typ K",null,null,100,958.3,{"$f":"G6-10","v":90},4.3200000000000002E-2]
[null,null,null,"CIMM",null,null,95,961.9,{"$f":"G7-10","v":85},3.9300000000000002E-2]
[null,null,null,"VAREM",null,null,90,965.3,80,3.56E-2]
[null,null,null,"FERRO",null,null,85,968.6,75,3.2099999999999997E-2]
[null,null,null,null,null,null,80,971.8,70,2.87E-2]
[null,null,null,null,null,null,75,974.8,65,2.5600000000000001E-2]
[null,null,null,null,null,null,70,977.8,60,2.24E-2]
[null,null,null,null,null,null,65,980.5,55,1.9599999999999999E-2]
[null,null,null,null,null,null,60,983.2,50,1.6799999999999999E-2]
[null,null,null,null,null,null,55,985.73,45,{"$f":"1.42*10^(-2)","v":1.4199999999999999E-2}]
{"$rows_left_out":96}
{"sheet":"gestosc wody","index":11,"n_rows":19,"n_cols":4,"rows_kept":19,"cut":false,"hidden":true,"merged":[]}
[]
[null,"ciepło właściwe wody",4.1900000000000004,"kJ/K*kg"]
[null,"przyśpieszenie ziemskie",9.81,"m/s2"]
[null,"Gęstość wody dla:"]
[null,30,995.67,"kg/m3"]
[null,35,994.06,"kg/m3"]
[null,40,992.24,"kg/m3"]
[null,45,990.25,"kg/m3"]
[null,50,988.07,"kg/m3"]
[null,55,985.73,"kg/m3"]
[null,60,983.24,"kg/m3"]
[null,65,980.59,"kg/m3"]
[null,70,977.81,"kg/m3"]
[null,75,974.89,"kg/m3"]
[null,80,971.83,"kg/m3"]
{"$rows_left_out":4}